Target
Mitogen-activated protein kinase kinase kinase kinase 2
Ligand
BDBM4552
Substrate
Meas. Tech.
ChEMBL_655294 (CHEMBL1244338)
IC50
9.9±n/a nM
Citation
 Remsing Rix, LLRix, UColinge, JHantschel, OBennett, KLStranzl, TMüller, ABaumgartner, CValent, PAugustin, MTill, JHSuperti-Furga, G Global target profile of the kinase inhibitor bosutinib in primary chronic myeloid leukemia cells. Leukemia 23:477-85 (2009)  
Target
Name:
Mitogen-activated protein kinase kinase kinase kinase 2
Synonyms:
2.7.11.1 GC kinase Germinal center kinase MAP4K2 MEK kinase kinase 2 RAB8IP | Rab8-interacting protein
Type:
Mol. Mass.:
91551.35
Organism:
Homo sapiens (Human)
Description:
Residue:
820
  
Inhibitor
Name:
BDBM4552
Synonyms:
4-[(2,4-Dichloro-5-methoxyphenyl)amino]-6-methoxy-7-[3-(4-methyl-1-piperazinyl)propoxy]-3-quinolinecarbonitrile BOSUTINIB SKI-606
Type:
Small organic molecule
Emp. Form.:
C26H29Cl2N5O3
Mol. Mass.:
530.446
SMILES:
COc1cc(Nc2c(cnc3cc(OCCCN4CCN(C)CC4)c(OC)cc23)C#N)c(Cl)cc1Cl
: