Target
Calcium/calmodulin-dependent protein kinase type II subunit gamma
Ligand
BDBM4552
Substrate
Meas. Tech.
ChEMBL_655301 (CHEMBL1244345)
IC50
184±n/a nM
Citation
 Remsing Rix, LLRix, UColinge, JHantschel, OBennett, KLStranzl, TMüller, ABaumgartner, CValent, PAugustin, MTill, JHSuperti-Furga, G Global target profile of the kinase inhibitor bosutinib in primary chronic myeloid leukemia cells. Leukemia 23:477-85 (2009)  
Target
Name:
Calcium/calmodulin-dependent protein kinase type II subunit gamma
Synonyms:
2.7.11.17 CAMK-II CAMKG CaM kinase II gamma CaMK-II subunit gamma Calcium/calmodulin-dependent protein kinase type II subunit gamma (CAMKllg) | KCC2G_HUMAN
Type:
Protein
Mol. Mass.:
62621.56
Organism:
Homo sapiens (Human)
Description:
Q13555
Residue:
558
  
Inhibitor
Name:
BDBM4552
Synonyms:
4-[(2,4-Dichloro-5-methoxyphenyl)amino]-6-methoxy-7-[3-(4-methyl-1-piperazinyl)propoxy]-3-quinolinecarbonitrile BOSUTINIB SKI-606
Type:
Small organic molecule
Emp. Form.:
C26H29Cl2N5O3
Mol. Mass.:
530.446
SMILES:
COc1cc(Nc2c(cnc3cc(OCCCN4CCN(C)CC4)c(OC)cc23)C#N)c(Cl)cc1Cl
: