Target
Mitogen-activated protein kinase 15
Ligand
BDBM50308060
Substrate
Meas. Tech.
ChEMBL_655789 (CHEMBL1244833)
Kd
4.9±n/a nM
Citation
 Zarrinkar, PPGunawardane, RNCramer, MDGardner, MFBrigham, DBelli, BKaraman, MWPratz, KWPallares, GChao, QSprankle, KGPatel, HKLevis, MArmstrong, RCJames, JBhagwat, SS AC220 is a uniquely potent and selective inhibitor of FLT3 for the treatment of acute myeloid leukemia (AML). Blood 114:2984-92 (2009)  
Target
Name:
Mitogen-activated protein kinase 15
Synonyms:
ERK-8 ERK8 MAPK15 Mitogen-activated protein kinase 15
Type:
Serine/threonine-protein kinase
Mol. Mass.:
59850.14
Organism:
Homo sapiens (Human)
Description:
gi_95147356
Residue:
544
  
Inhibitor
Name:
BDBM50308060
Synonyms:
16-hydroxy-16-(hydroxymethyl)-15-methyl-28-oxa-4,14,19-triazaoctacyclo[12.11.2.1^{15,18}.0^{2,6}.0^{7,27}.0^{8,13}.0^{19,26}.0^{20,25}]octacosa-1(26),2(6),7(27),8(13),9,11,20(25),21,23-nonaen-3-one CHEMBL603469 | US11370779, Compound CEP-701
Type:
Small organic molecule
Emp. Form.:
C26H21N3O4
Mol. Mass.:
439.4626
SMILES:
C[C@]12O[C@H](C[C@]1(O)CO)n1c3ccccc3c3c4C(=O)NCc4c4c5ccccc5n2c4c13
: