Target
Ribosomal protein S6 kinase alpha-2
Ligand
BDBM50300690
Substrate
Meas. Tech.
ChEMBL_655927 (CHEMBL1244971)
Kd
>10000±n/a nM
Citation
 Zarrinkar, PPGunawardane, RNCramer, MDGardner, MFBrigham, DBelli, BKaraman, MWPratz, KWPallares, GChao, QSprankle, KGPatel, HKLevis, MArmstrong, RCJames, JBhagwat, SS AC220 is a uniquely potent and selective inhibitor of FLT3 for the treatment of acute myeloid leukemia (AML). Blood 114:2984-92 (2009)  
Target
Name:
Ribosomal protein S6 kinase alpha-2
Synonyms:
90 kDa ribosomal protein S6 kinase 2 KS6A2_HUMAN MAPKAPK1C RPS6KA2(Kin.Dom.1 - N-terminal) Ribosomal S6 Kinase 3 (RSK-3) Ribosomal protein S6 kinase alpha 2 (RSK2) p90-RSK 2 pp90RSK3
Type:
Serine/threonine-protein kinase
Mol. Mass.:
83259.46
Organism:
Homo sapiens (Human)
Description:
Residue:
733
  
Inhibitor
Name:
BDBM50300690
Synonyms:
1-(5-Tert-Butyl-1,2-Oxazol-3-Yl)-3-(4-{7-[2-(Morpholin-4-Yl)ethoxy]imidazo[2,1-B][1,3]benzothiazol-2-Yl}phenyl)urea AC 220 AC010220 ASP-2689 N-(5-tert-Butyl-isoxazol-3-yl)-N'-{4-[7-(2-morpholin-4-yl-ethoxy)imidazo[2,1-b][1,3]benzothiazol-2-yl]phenyl}urea Quizartinib (AC220) US11542261, Compound quizartinib | US9216997, Quizartinib (positive compound)
Type:
Small organic molecule
Emp. Form.:
C29H32N6O4S
Mol. Mass.:
560.667
SMILES:
CC(C)(C)c1cc(NC(=O)Nc2ccc(cc2)-c2cn3c(n2)sc2cc(OCCN4CCOCC4)ccc32)no1
: