Target
Ribosomal protein S6 kinase alpha-4
Ligand
BDBM50326054
Substrate
Meas. Tech.
ChEMBL_655920 (CHEMBL1244964)
Kd
>10000±n/a nM
Citation
 Zarrinkar, PPGunawardane, RNCramer, MDGardner, MFBrigham, DBelli, BKaraman, MWPratz, KWPallares, GChao, QSprankle, KGPatel, HKLevis, MArmstrong, RCJames, JBhagwat, SS AC220 is a uniquely potent and selective inhibitor of FLT3 for the treatment of acute myeloid leukemia (AML). Blood 114:2984-92 (2009)  
Target
Name:
Ribosomal protein S6 kinase alpha-4
Synonyms:
90 kDa ribosomal protein S6 kinase 4 MSK2 Nuclear mitogen- and stress-activated protein kinase 2 RPS6KA4(Kin.Dom.1 - N-terminal) Ribosomal protein S6 kinase Ribosomal protein S6 kinase alpha-4 | Ribosomal protein kinase B
Type:
Serine/threonine-protein kinase
Mol. Mass.:
85620.38
Organism:
Homo sapiens (Human)
Description:
Recombinant MSK2 was phosphorylated by incubation with active p38alpha before assays.
Residue:
772
  
Inhibitor
Name:
BDBM50326054
Synonyms:
CHEMBL1240703
Type:
Small organic molecule
Emp. Form.:
C35H30N4O5
Mol. Mass.:
586.6365
SMILES:
CO[C@@H]1[C@@H](C[C@H]2O[C@]1(C)n1c3ccccc3c3c4[C@H](O)NC(=O)c4c4c5ccccc5n2c4c13)N(C)C(=O)c1ccccc1
: