Target
Chymase
Ligand
BDBM50326056
Substrate
Meas. Tech.
ChEMBL_656008 (CHEMBL1245052)
IC50
26±n/a nM
Citation
 Liverton, NJCarroll, SSDimuzio, JFandozzi, CGraham, DJHazuda, DHolloway, MKLudmerer, SWMcCauley, JAMcIntyre, CJOlsen, DBRudd, MTStahlhut, MVacca, JP MK-7009, a potent and selective inhibitor of hepatitis C virus NS3/4A protease. Antimicrob Agents Chemother 54:305-11 (2009)  
Target
Name:
Chymase
Synonyms:
Alpha-chymase CMA1_HUMAN CYM Mast cell protease I
Type:
Enzyme
Mol. Mass.:
27340.12
Organism:
Homo sapiens (Human)
Description:
Residue:
247
  
Inhibitor
Name:
BDBM50326056
Synonyms:
(1S,3aR,6aS)-2-((S)-2-((S)-2-cyclohexyl-2-(pyrazine-2-carboxamido)acetamido)-3,3-dimethylbutanoyl)-N-((S)-1-(cyclopropylamino)-1,2-dioxohexan-3-yl)octahydrocyclopenta[c]pyrrole-1-carboxamide (1S,3aR,6aS)-2-((S)-2-((S)-2-cyclohexyl-2-(pyrazine-6-carboxamido)acetamido)-3,3-dimethylbutanoyl)-N-((S)-1-(cyclopropylamino)-1,2-dioxohexan-3-yl)-octahydrocyclopenta[c]pyrrole-1-carboxamide TELAPREVIR VX-950
Type:
Small organic molecule
Emp. Form.:
C36H53N7O6
Mol. Mass.:
679.8493
SMILES:
CCC[C@H](NC(=O)[C@@H]1[C@H]2CCC[C@H]2CN1C(=O)[C@@H](NC(=O)[C@@H](NC(=O)c1cnccn1)C1CCCCC1)C(C)(C)C)C(=O)C(=O)NC1CC1
: