Target
Breakpoint cluster region protein/Tyrosine-protein kinase ABL1
Ligand
BDBM50326092
Substrate
Meas. Tech.
ChEMBL_659667 (CHEMBL1246089)
IC50
500±n/a nM
Citation
 Reddy, MVPallela, VRCosenza, SCMallireddigari, MRPatti, RBonagura, MTruongcao, MAkula, BJatiani, SSReddy, EP Design, synthesis and evaluation of (E)-alpha-benzylthio chalcones as novel inhibitors of BCR-ABL kinase. Bioorg Med Chem 18:2317-26 (2010)  
Target
Name:
Breakpoint cluster region protein/Tyrosine-protein kinase ABL1
Synonyms:
Bcr-Abl Breakpoint cluster region protein /Tyrosine-protein kinase ABL | Tyrosine-protein kinase ABL1/Breakpoint cluster region protein
Type:
Enzyme
Mol. Mass.:
Description:
Components:
This complex has 2 components.
Component 1
Name:
Tyrosine-protein kinase ABL1
Synonyms:
ABL ABL1_HUMAN JTK7 Proto-oncogene tyrosine-protein kinase ABL1 Tyrosine-protein kinase ABL V-abl Abelson murine leukemia viral oncogene homolog 1 p150 | tyrosine-protein kinase ABL1 isoform a
Type:
Enzyme
Mol. Mass.:
122897.30
Organism:
Homo sapiens (Human)
Description:
P00519
Residue:
1130
  
Component 2
Name:
Breakpoint cluster region protein
Synonyms:
BCR BCR_HUMAN Breakpoint cluster region protein | D22S11
Type:
PROTEIN
Mol. Mass.:
142824.75
Organism:
Homo sapiens (Human)
Description:
ChEMBL_305348
Residue:
1271
  
Inhibitor
Name:
BDBM50326092
Synonyms:
(E)-3-(4-Fluoro-3-nitrophenyl)-2-(4-fluorobenzylthio)-1-(4-(4-(2-hydroxyethyl)piperazine-1-carbonyl)phenyl)prop-2-en-1-one | CHEMBL1242581
Type:
Small organic molecule
Emp. Form.:
C29H27F2N3O5S
Mol. Mass.:
567.604
SMILES:
OCCN1CCN(CC1)C(=O)c1ccc(cc1)C(=O)C(\SCc1ccc(F)cc1)=C/c1ccc(F)c(c1)[N+]([O-])=O
: