Target
Breakpoint cluster region protein/Tyrosine-protein kinase ABL1
Ligand
BDBM50326063
Substrate
Meas. Tech.
ChEMBL_659667 (CHEMBL1246089)
IC50
10000±n/a nM
Citation
 Reddy, MVPallela, VRCosenza, SCMallireddigari, MRPatti, RBonagura, MTruongcao, MAkula, BJatiani, SSReddy, EP Design, synthesis and evaluation of (E)-alpha-benzylthio chalcones as novel inhibitors of BCR-ABL kinase. Bioorg Med Chem 18:2317-26 (2010)  
Target
Name:
Breakpoint cluster region protein/Tyrosine-protein kinase ABL1
Synonyms:
Bcr-Abl Breakpoint cluster region protein /Tyrosine-protein kinase ABL | Tyrosine-protein kinase ABL1/Breakpoint cluster region protein
Type:
Enzyme
Mol. Mass.:
Description:
Components:
This complex has 2 components.
Component 1
Name:
Tyrosine-protein kinase ABL1
Synonyms:
ABL ABL1_HUMAN JTK7 Proto-oncogene tyrosine-protein kinase ABL1 Tyrosine-protein kinase ABL V-abl Abelson murine leukemia viral oncogene homolog 1 p150 | tyrosine-protein kinase ABL1 isoform a
Type:
Enzyme
Mol. Mass.:
122897.30
Organism:
Homo sapiens (Human)
Description:
P00519
Residue:
1130
  
Component 2
Name:
Breakpoint cluster region protein
Synonyms:
BCR BCR_HUMAN Breakpoint cluster region protein | D22S11
Type:
PROTEIN
Mol. Mass.:
142824.75
Organism:
Homo sapiens (Human)
Description:
ChEMBL_305348
Residue:
1271
  
Inhibitor
Name:
BDBM50326063
Synonyms:
(E)-4-(2-(4-Chlorobenzylthio)-3-(4-chloro-3-nitrophenyl)acryloyl)benzoic acid | CHEMBL1242579
Type:
Small organic molecule
Emp. Form.:
C23H15Cl2NO5S
Mol. Mass.:
488.34
SMILES:
OC(=O)c1ccc(cc1)C(=O)C(\SCc1ccc(Cl)cc1)=C/c1ccc(Cl)c(c1)[N+]([O-])=O
: