Target
Epidermal growth factor receptor
Ligand
BDBM50326061
Substrate
Meas. Tech.
ChEMBL_659675 (CHEMBL1246097)
IC50
>20000±n/a nM
Citation
 Reddy, MVPallela, VRCosenza, SCMallireddigari, MRPatti, RBonagura, MTruongcao, MAkula, BJatiani, SSReddy, EP Design, synthesis and evaluation of (E)-alpha-benzylthio chalcones as novel inhibitors of BCR-ABL kinase. Bioorg Med Chem 18:2317-26 (2010)  
Target
Name:
Epidermal growth factor receptor
Synonyms:
EGF Receptor Substrate EGFR_HUMAN ERBB1 Epidermal Growth Factor Receptor erbB-1 Epidermal growth factor receptor (EGFR) HER1 Proto-oncogene c-ErbB-1 Tyrosine-Protein Kinase ErbB-1
Type:
Receptor Kinase Domain
Mol. Mass.:
134279.59
Organism:
Homo sapiens (Human)
Description:
P00533
Residue:
1210
  
Inhibitor
Name:
BDBM50326061
Synonyms:
(E)-4-(2-(4-Bromobenzylthio)-3-(4-fluoro-3-nitrophenyl)acryloyl)benzoic acid | CHEMBL1242482
Type:
Small organic molecule
Emp. Form.:
C23H15BrFNO5S
Mol. Mass.:
516.336
SMILES:
OC(=O)c1ccc(cc1)C(=O)C(\SCc1ccc(Br)cc1)=C/c1ccc(F)c(c1)[N+]([O-])=O
: