Target
Tyrosine-protein phosphatase non-receptor type 1
Ligand
BDBM50326165
Substrate
Meas. Tech.
ChEMBL_658721 (CHEMBL1248462)
IC50
38±n/a nM
Citation
 Lakshminarayana, NPrasad, YRGharat, LThomas, ANarayanan, SRaghuram, ASrinivasan, CVGopalan, B Synthesis and evaluation of some novel dibenzo[b,d]furan carboxylic acids as potential anti-diabetic agents. Eur J Med Chem 45:3709-18 (2010)  
Target
Name:
Tyrosine-protein phosphatase non-receptor type 1
Synonyms:
PTN1_HUMAN PTPN1 Protein tyrosine phosphatase-1B (PTP1B) Protein-tyrosine phosphatase 1B (PTP1B) Tyrosine-protein phosphatase non-receptor type 1 (PTP1B)
Type:
Protein phosphatase
Mol. Mass.:
49963.76
Organism:
Homo sapiens (Human)
Description:
Human recombinant GST-fusion PTP1B (1-435).
Residue:
435
  
Inhibitor
Name:
BDBM50326165
Synonyms:
CHEMBL1241315 | oxalylaminobenzoic acid
Type:
Small organic molecule
Emp. Form.:
C34H35N3O11
Mol. Mass.:
661.6552
SMILES:
CCc1cc(C[C@H]2NC(=O)CN(CCCCOc3cccc(O)c3C(=O)OC)C2=O)ccc1N(C(=O)C(O)=O)c1ccccc1C(O)=O
: