Target
Receptor-type tyrosine-protein phosphatase F
Ligand
BDBM50326165
Substrate
Meas. Tech.
ChEMBL_658719 (CHEMBL1248460)
IC50
410±n/a nM
Citation
 Lakshminarayana, NPrasad, YRGharat, LThomas, ANarayanan, SRaghuram, ASrinivasan, CVGopalan, B Synthesis and evaluation of some novel dibenzo[b,d]furan carboxylic acids as potential anti-diabetic agents. Eur J Med Chem 45:3709-18 (2010)  
Target
Name:
Receptor-type tyrosine-protein phosphatase F
Synonyms:
LAR Leukocyte common antigen related (LAR) PTPRF_HUMAN Receptor-type tyrosine-protein phosphatase F (LAR)
Type:
Protein
Mol. Mass.:
212869.85
Organism:
Homo sapiens (Human)
Description:
P10586
Residue:
1907
  
Inhibitor
Name:
BDBM50326165
Synonyms:
CHEMBL1241315 | oxalylaminobenzoic acid
Type:
Small organic molecule
Emp. Form.:
C34H35N3O11
Mol. Mass.:
661.6552
SMILES:
CCc1cc(C[C@H]2NC(=O)CN(CCCCOc3cccc(O)c3C(=O)OC)C2=O)ccc1N(C(=O)C(O)=O)c1ccccc1C(O)=O
: