Target
Aromatase
Ligand
BDBM8594
Substrate
Meas. Tech.
ChEMBL_658930 (CHEMBL1246069)
IC50
5570±n/a nM
Citation
 Nagar, SSaha, A Exploring benzcyclo derivatives as potent aromatase inhibitors using ligand-based modeling studies. Eur J Med Chem 45:4307-15 (2010)  
Target
Name:
Aromatase
Synonyms:
ARO1 CP19A_HUMAN CYP19 CYPXIX Cytochrome P450 19A1 Cytochrome P450-C19 (CYP19) FL cytokine receptor precursor | P-450AROM
Type:
Enzyme
Mol. Mass.:
57888.92
Organism:
Homo sapiens (Human)
Description:
P11511
Residue:
503
  
Inhibitor
Name:
BDBM8594
Synonyms:
(3-Pyridylmethylene)indane 11b | 3-{[(1Z)-5-methoxy-2,3-dihydro-1H-inden-1-ylidene]methyl}pyridine
Type:
Small organic molecule
Emp. Form.:
C16H15NO
Mol. Mass.:
237.2964
SMILES:
COc1ccc2\C(CCc2c1)=C/c1cccnc1
: