Target
Aurora kinase B
Ligand
BDBM50326200
Substrate
Meas. Tech.
ChEMBL_659328 (CHEMBL1247955)
IC50
430±n/a nM
Citation
 Cee, VJSchenkel, LBHodous, BLDeak, HLNguyen, HNOlivieri, PRRomero, KBak, ABe, XBellon, SBush, TLCheng, ACChung, GCoats, SEden, PMHanestad, KGallant, PLGu, YHuang, XKendall, RLLin, MHMorrison, MJPatel, VFRadinsky, RRose, PERoss, SSun, JRTang, JZhao, HPayton, MGeuns-Meyer, SD Discovery of a potent, selective, and orally bioavailable pyridinyl-pyrimidine phthalazine aurora kinase inhibitor. J Med Chem 53:6368-77 (2010)  
Target
Name:
Aurora kinase B
Synonyms:
AIK2 AIM1 ARK2 AURKB_HUMAN Aurora B-INCENP Aurora kinase B (AURKB) STK-1 STK12 Serine/threonine-protein kinase aurora B
Type:
Protein
Mol. Mass.:
39327.72
Organism:
Homo sapiens (Human)
Description:
Q96GD4
Residue:
344
  
Inhibitor
Name:
BDBM50326200
Synonyms:
3-Chloro-N-(3-methyl-4-(3-(2-(methylamino)pyrimidin-4-yl)-pyridin-2-yloxy)phenyl)benzamide | CHEMBL1243008
Type:
Small organic molecule
Emp. Form.:
C24H20ClN5O2
Mol. Mass.:
445.901
SMILES:
CNc1nccc(n1)-c1cccnc1Oc1ccc(NC(=O)c2cccc(Cl)c2)cc1C
: