Target
Tyrosine-protein kinase BTK
Ligand
BDBM50326198
Substrate
Meas. Tech.
ChEMBL_659343 (CHEMBL1247970)
IC50
>8000±n/a nM
Citation
 Cee, VJSchenkel, LBHodous, BLDeak, HLNguyen, HNOlivieri, PRRomero, KBak, ABe, XBellon, SBush, TLCheng, ACChung, GCoats, SEden, PMHanestad, KGallant, PLGu, YHuang, XKendall, RLLin, MHMorrison, MJPatel, VFRadinsky, RRose, PERoss, SSun, JRTang, JZhao, HPayton, MGeuns-Meyer, SD Discovery of a potent, selective, and orally bioavailable pyridinyl-pyrimidine phthalazine aurora kinase inhibitor. J Med Chem 53:6368-77 (2010)  
Target
Name:
Tyrosine-protein kinase BTK
Synonyms:
AGMX1 Agammaglobulinaemia tyrosine kinase B cell progenitor kinase BPK BTK_HUMAN Tyrosine Kinase BTK Tyrosine-protein kinase BTK (BTK)
Type:
Enzyme
Mol. Mass.:
76289.95
Organism:
Homo sapiens (Human)
Description:
Q06187
Residue:
659
  
Inhibitor
Name:
BDBM50326198
Synonyms:
CHEMBL1242977 | N-(3-Methyl-4-(3-(2-(methylamino)pyrimidin-4-yl)pyridin-2-yloxy)phenyl)-3-(trifluoromethyl)benzamide
Type:
Small organic molecule
Emp. Form.:
C25H20F3N5O2
Mol. Mass.:
479.4538
SMILES:
CNc1nccc(n1)-c1cccnc1Oc1ccc(NC(=O)c2cccc(c2)C(F)(F)F)cc1C
: