Target
Ribosomal protein S6 kinase beta-1
Ligand
BDBM50326206
Substrate
Meas. Tech.
ChEMBL_659345 (CHEMBL1247972)
IC50
>1000±n/a nM
Citation
 Cee, VJSchenkel, LBHodous, BLDeak, HLNguyen, HNOlivieri, PRRomero, KBak, ABe, XBellon, SBush, TLCheng, ACChung, GCoats, SEden, PMHanestad, KGallant, PLGu, YHuang, XKendall, RLLin, MHMorrison, MJPatel, VFRadinsky, RRose, PERoss, SSun, JRTang, JZhao, HPayton, MGeuns-Meyer, SD Discovery of a potent, selective, and orally bioavailable pyridinyl-pyrimidine phthalazine aurora kinase inhibitor. J Med Chem 53:6368-77 (2010)  
Target
Name:
Ribosomal protein S6 kinase beta-1
Synonyms:
70 kDa ribosomal protein S6 kinase 1 70 kDa ribosomal protein kinase (p70S6K) Protein kinase 70S6K (T412E) RPS6KB1 Ribosomal protein S6 kinase I STK14A p70S6K1
Type:
Enzyme
Mol. Mass.:
59139.89
Organism:
Homo sapiens (Human)
Description:
His-tagged S6K1.
Residue:
525
  
Inhibitor
Name:
BDBM50326206
Synonyms:
CHEMBL1243200 | N-(4-(3-(2-(Methylamino)pyrimidin-4-yl)pyridin-2-yloxy)phenyl)-2-(phenylamino)benzamide
Type:
Small organic molecule
Emp. Form.:
C29H24N6O2
Mol. Mass.:
488.5399
SMILES:
CNc1nccc(n1)-c1cccnc1Oc1ccc(NC(=O)c2ccccc2Nc2ccccc2)cc1
: