Target
Baculoviral IAP repeat-containing protein 2
Ligand
BDBM50326214
Substrate
Meas. Tech.
ChEMBL_659380 (CHEMBL1248007)
Ki
1.6±n/a nM
Citation
 Sun, HLu, JLiu, LYi, HQiu, SYang, CYDeschamps, JRWang, S Nonpeptidic and potent small-molecule inhibitors of cIAP-1/2 and XIAP proteins. J Med Chem 53:6361-7 (2010)  
Target
Name:
Baculoviral IAP repeat-containing protein 2
Synonyms:
API1 BIRC2_HUMAN Cellular inhibitor of apoptosis 1 MIHB | RNF48
Type:
Protein
Mol. Mass.:
69900.47
Organism:
Homo sapiens (Human)
Description:
Q13490
Residue:
618
  
Inhibitor
Name:
BDBM50326214
Synonyms:
(3S,6S,9R,10aR)-N-Benzhydryl-6-((S)-2-(methylamino)-propanamido)-5-oxo-9-(2-phenylacetamido)decahydropyrrolo-[1,2-a]azocine-3-carboxamide | CHEMBL1241424
Type:
Small organic molecule
Emp. Form.:
C36H43N5O4
Mol. Mass.:
609.7577
SMILES:
CN[C@@H](C)C(=O)N[C@H]1CC[C@H](C[C@H]2CC[C@H](N2C1=O)C(=O)NC(c1ccccc1)c1ccccc1)NC(=O)Cc1ccccc1
: