Target
E3 ubiquitin-protein ligase XIAP
Ligand
BDBM50326215
Substrate
Meas. Tech.
ChEMBL_659379 (CHEMBL1248006)
IC50
1068±n/a nM
Citation
 Sun, HLu, JLiu, LYi, HQiu, SYang, CYDeschamps, JRWang, S Nonpeptidic and potent small-molecule inhibitors of cIAP-1/2 and XIAP proteins. J Med Chem 53:6361-7 (2010)  
Target
Name:
E3 ubiquitin-protein ligase XIAP
Synonyms:
API3 E3 ubiquitin-protein ligase XIAP Inhibitor of apoptosis protein 3 X-linked inhibitor of apoptosis XIAP | XIAP_HUMAN
Type:
Protein
Mol. Mass.:
56685.27
Organism:
Homo sapiens (Human)
Description:
P98170
Residue:
497
  
Inhibitor
Name:
BDBM50326215
Synonyms:
(3S,6S,9R,10aR)-N-benzhydryl-9-hydroxy-6-((S)-2-(methylamino)propanamido)-5-oxodecahydropyrrolo[1,2-a]azocine-3-carboxamide | CHEMBL1243385
Type:
Small organic molecule
Emp. Form.:
C28H36N4O4
Mol. Mass.:
492.6098
SMILES:
CN[C@@H](C)C(=O)N[C@H]1CC[C@@H](O)C[C@H]2CC[C@H](N2C1=O)C(=O)NC(c1ccccc1)c1ccccc1
: