Target
S-methyl-5'-thioadenosine phosphorylase
Ligand
BDBM50326399
Substrate
Meas. Tech.
ChEMBL_657428 (CHEMBL1246404)
Ki
0.800±n/a nM
Citation
 Longshaw, AIAdanitsch, FGutierrez, JAEvans, GBTyler, PCSchramm, VL Design and synthesis of potent"sulfur-free" transition state analogue inhibitors of 5'-methylthioadenosine nucleosidase and 5'-methylthioadenosine phosphorylase. J Med Chem 53:6730-46 (2010)  
Target
Name:
S-methyl-5'-thioadenosine phosphorylase
Synonyms:
5'-Methylthioadenosine phosphorylase (MTAP) MTA phosphorylase MTAP_HUMAN Methylthioadenosine Phosphorylase (MTAP) | S-methyl-5 -thioadenosine phosphorylase
Type:
Enzyme
Mol. Mass.:
31239.23
Organism:
Homo sapiens (Human)
Description:
Residue:
283
  
Inhibitor
Name:
BDBM50326399
Synonyms:
(+/-)-trans-4-Butyl-1-[(9-deazaadenin-9-yl)methyl]-3-hydroxypyrrolidine CHEMBL1243249
Type:
Small organic molecule
Emp. Form.:
C15H23N5O
Mol. Mass.:
289.376
SMILES:
CCCC[C@H]1CN(Cc2c[nH]c3c(N)ncnc23)C[C@@H]1O
: