Target
Protein-tyrosine-phosphatase
Ligand
BDBM50326512
Substrate
Meas. Tech.
ChEMBL_658096 (CHEMBL1249161)
IC50
1300±n/a nM
Citation
 Comeau, ABCritton, DAPage, RSeto, CT A focused library of protein tyrosine phosphatase inhibitors. J Med Chem 53:6768-72 (2010)  
Target
Name:
Protein-tyrosine-phosphatase
Synonyms:
Secreted effector protein | Secreted protein-tyrosine phosphatase
Type:
PROTEIN
Mol. Mass.:
50881.86
Organism:
Yersinia pestis
Description:
ChEMBL_810616
Residue:
468
  
Inhibitor
Name:
BDBM50326512
Synonyms:
2,2'-(4,4'-(2-(4-(4-cyanophenoxy)phenylcarbamoyl)-1,4-phenylene)bis(methylene)bis(oxy)bis(4,1-phenylene))bis(2-oxoacetic acid) | CHEMBL1240804
Type:
Small organic molecule
Emp. Form.:
C38H26N2O10
Mol. Mass.:
670.6204
SMILES:
OC(=O)C(=O)c1ccc(OCc2ccc(COc3ccc(cc3)C(=O)C(O)=O)c(c2)C(=O)Nc2ccc(Oc3ccc(cc3)C#N)cc2)cc1
: