Target
Epidermal growth factor receptor
Ligand
BDBM50326516
Substrate
Meas. Tech.
ChEMBL_658103 (CHEMBL1249168)
IC50
1.81±n/a nM
Citation
 Pisaneschi, FNguyen, QDShamsaei, EGlaser, MRobins, EKaliszczak, MSmith, GSpivey, ACAboagye, EO Development of a new epidermal growth factor receptor positron emission tomography imaging agent based on the 3-cyanoquinoline core: synthesis and biological evaluation. Bioorg Med Chem 18:6634-45 (2010)  
Target
Name:
Epidermal growth factor receptor
Synonyms:
EGF Receptor Substrate EGFR_HUMAN ERBB1 Epidermal Growth Factor Receptor erbB-1 Epidermal growth factor receptor (EGFR) HER1 Proto-oncogene c-ErbB-1 Tyrosine-Protein Kinase ErbB-1
Type:
Receptor Kinase Domain
Mol. Mass.:
134279.59
Organism:
Homo sapiens (Human)
Description:
P00533
Residue:
1210
  
Inhibitor
Name:
BDBM50326516
Synonyms:
(E)-4-{[1-(2-Fluoroethyl)-1H-[1,2,3]triazol-4-ylmethyl]-amino}-but-2-enoic acid[4-(3-chloro-4-fluoro-phenylamino)-3-cyano-7-ethoxy-quinolin-6-yl]-amide | CHEMBL1243283
Type:
Small organic molecule
Emp. Form.:
C27H25ClF2N8O2
Mol. Mass.:
566.99
SMILES:
CCOc1cc2ncc(C#N)c(Nc3ccc(F)c(Cl)c3)c2cc1NC(=O)\C=C\CNCc1cn(CCF)nn1
: