Target
Prostaglandin G/H synthase 1
Ligand
BDBM50169047
Substrate
Meas. Tech.
ChEMBL_658293 (CHEMBL1246850)
IC50
3200±n/a nM
Citation
 Harrak, YCasula, GBasset, JRosell, GPlescia, SRaffa, DCusimano, MGPouplana, RPujol, MD Synthesis, anti-inflammatory activity, and in vitro antitumor effect of a novel class of cyclooxygenase inhibitors: 4-(aryloyl)phenyl methyl sulfones. J Med Chem 53:6560-71 (2010)  
Target
Name:
Prostaglandin G/H synthase 1
Synonyms:
COX1 Cyclooxygenase-1 (COX-1) PTGS1 | Prostaglandin G/H synthase (cyclooxygenase)
Type:
Protein
Mol. Mass.:
68868.60
Organism:
Ovis aries (Sheep)
Description:
Residue:
600
  
Inhibitor
Name:
BDBM50169047
Synonyms:
(S)-2-(4-Isobutyl-phenyl)-propionic acid (S)-ibuprofen DEXIBUPROFEN | IBUPROFEN LYSINE
Type:
Small organic molecule
Emp. Form.:
C13H18O2
Mol. Mass.:
206.2808
SMILES:
CC(C)Cc1ccc(cc1)[C@H](C)C(O)=O
: