Target
Beta-2 adrenergic receptor
Ligand
BDBM50326543
Substrate
Meas. Tech.
ChEMBL_658303 (CHEMBL1246860)
EC50
0.045±n/a nM
Citation
 Glossop, PALane, CAPrice, DABunnage, MELewthwaite, RAJames, KBrown, ADYeadon, MPerros-Huguet, CTrevethick, MAClarke, NPWebster, RJones, RMBurrows, JLFeeder, NTaylor, SCSpence, FJ Inhalation by design: novel ultra-long-actingß(2)-adrenoreceptor agonists for inhaled once-daily treatment of asthma and chronic obstructive pulmonary disease that utilize a sulfonamide agonist headgroup. J Med Chem 53:6640-52 (2010)  
Target
Name:
Beta-2 adrenergic receptor
Synonyms:
ADRB2 ADRB2_HUMAN Beta-2 adrenoceptor | Beta-2 adrenoreceptor
Type:
Mol. Mass.:
46461.69
Organism:
Homo sapiens (Human)
Description:
P07550
Residue:
413
  
Inhibitor
Name:
BDBM50326543
Synonyms:
(R)-N-(4-hydroxy-2,6-dimethylbenzyl)-2-(3-(2-(2-hydroxy-2-(4-hydroxy-3-(methylsulfonamido)phenyl)ethylamino)-2-methylpropyl)phenyl)acetamide | CHEMBL1243101
Type:
Small organic molecule
Emp. Form.:
C30H39N3O6S
Mol. Mass.:
569.712
SMILES:
Cc1cc(O)cc(C)c1CNC(=O)Cc1cccc(CC(C)(C)NC[C@H](O)c2ccc(O)c(NS(C)(=O)=O)c2)c1
: