Target
Sodium-dependent dopamine transporter
Ligand
BDBM50318666
Substrate
Meas. Tech.
ChEMBL_658549 (CHEMBL1247882)
IC50
>10000±n/a nM
Citation
 Rottmann, MMcNamara, CYeung, BKLee, MCZou, BRussell, BSeitz, PPlouffe, DMDharia, NVTan, JCohen, SBSpencer, KRGonzález-Páez, GELakshminarayana, SBGoh, ASuwanarusk, RJegla, TSchmitt, EKBeck, HPBrun, RNosten, FRenia, LDartois, VKeller, THFidock, DAWinzeler, EADiagana, TT Spiroindolones, a potent compound class for the treatment of malaria. Science 329:1175-80 (2010)  
Target
Name:
Sodium-dependent dopamine transporter
Synonyms:
DA transporter DAT1 Dopamine transporter protein (DAT) SC6A3_HUMAN Sodium-dependent dopamine transporter Solute carrier family 6 member 3
Type:
Multi-pass membrane protein
Mol. Mass.:
68497.11
Organism:
Homo sapiens (Human)
Description:
Q01959
Residue:
620
  
Inhibitor
Name:
BDBM50318666
Synonyms:
(1R,3S)-5',7-Dichloro-6-fluoro-3-methyl-2,3,4,9-tetrahydrospiro-[beta-carboline-1,3'-indol]-2'(1'H)-one NITD609
Type:
Small organic molecule
Emp. Form.:
C19H14Cl2FN3O
Mol. Mass.:
390.238
SMILES:
C[C@H]1Cc2c([nH]c3cc(Cl)c(F)cc23)[C@@]2(N1)C(=O)Nc1ccc(Cl)cc21
: