Target
RAC-beta serine/threonine-protein kinase
Ligand
BDBM50326707
Substrate
Meas. Tech.
ChEMBL_662182 (CHEMBL1252173)
IC50
>10000±n/a nM
Citation
 Okuzumi, TFiedler, DZhang, CGray, DCAizenstein, BHoffman, RShokat, KM Inhibitor hijacking of Akt activation. Nat Chem Biol 5:484-93 (2009)  
Target
Name:
RAC-beta serine/threonine-protein kinase
Synonyms:
AKT2 PKB beta Protein kinase B (Akt 2) Protein kinase B, beta RAC-alpha serine/threonine-protein kinase (AKT2) RAC-beta serine/threonine-protein kinase (AKT2) Serine/threonine-protein kinase AKT2 | Serine/threonine-protein kinase Rac alpha/beta
Type:
Enzyme
Mol. Mass.:
55766.64
Organism:
Homo sapiens (Human)
Description:
Residue:
481
  
Inhibitor
Name:
BDBM50326707
Synonyms:
1-tert-butyl-3-(3-iodobenzyl)-1H-pyrazolo[3,4-d]pyrimidin-4-amine | CHEMBL1254115
Type:
Small organic molecule
Emp. Form.:
C16H18IN5
Mol. Mass.:
407.2521
SMILES:
CC(C)(C)n1nc(Cc2cccc(I)c2)c2c(N)ncnc12
: