Target
D(3) dopamine receptor
Ligand
BDBM50326726
Substrate
Meas. Tech.
ChEMBL_661593 (CHEMBL1251527)
Ki
6.84±n/a nM
Citation
 Ghosh, BAntonio, TGopishetty, BReith, MDutta, A Further delineation of hydrophobic binding sites in dopamine D(2)/D(3) receptors for N-4 substituents on the piperazine ring of the hybrid template 5/7-{[2-(4-aryl-piperazin-1-yl)-ethyl]-propyl-amino}-5,6,7,8-tetrahydro-naphthalen-2-ol. Bioorg Med Chem 18:5661-74 (2010)  
Target
Name:
D(3) dopamine receptor
Synonyms:
DOPAMINE D3 Dopamine D3 receptor | Drd3
Type:
Protein
Mol. Mass.:
49540.58
Organism:
Rattus norvegicus (Rat)
Description:
P19020
Residue:
446
  
Inhibitor
Name:
BDBM50326726
Synonyms:
7-(propyl(2-(4-(pyrimidin-2-yl)piperazin-1-yl)ethyl)amino)-5,6,7,8-tetrahydronaphthalen-2-ol | CHEMBL1254772
Type:
Small organic molecule
Emp. Form.:
C23H33N5O
Mol. Mass.:
395.541
SMILES:
CCCN(CCN1CCN(CC1)c1ncccn1)C1CCc2ccc(O)cc2C1
: