Target
D(3) dopamine receptor
Ligand
BDBM50020221
Substrate
Meas. Tech.
ChEMBL_661593 (CHEMBL1251527)
Ki
1.36±n/a nM
Citation
 Ghosh, BAntonio, TGopishetty, BReith, MDutta, A Further delineation of hydrophobic binding sites in dopamine D(2)/D(3) receptors for N-4 substituents on the piperazine ring of the hybrid template 5/7-{[2-(4-aryl-piperazin-1-yl)-ethyl]-propyl-amino}-5,6,7,8-tetrahydro-naphthalen-2-ol. Bioorg Med Chem 18:5661-74 (2010)  
Target
Name:
D(3) dopamine receptor
Synonyms:
DOPAMINE D3 Dopamine D3 receptor | Drd3
Type:
Protein
Mol. Mass.:
49540.58
Organism:
Rattus norvegicus (Rat)
Description:
P19020
Residue:
446
  
Inhibitor
Name:
BDBM50020221
Synonyms:
(-)-5-hydroxy-2-(dipropylamino)tetralin 5-hydroxy-2-(dipropylamino)tetralin 6-Dipropylamino-5,6,7,8-tetrahydro-naphthalen-1-ol (DP-5-ADTN) | CHEMBL273273
Type:
Small organic molecule
Emp. Form.:
C16H25NO
Mol. Mass.:
247.3758
SMILES:
CCCN(CCC)C1CCc2c(O)cccc2C1
: