Target
Potassium/sodium hyperpolarization-activated cyclic nucleotide-gated channel 2
Ligand
BDBM50326987
Substrate
Meas. Tech.
ChEMBL_663438 (CHEMBL1250986)
EC50
25470±n/a nM
Citation
 Melchiorre, MDel Lungo, MGuandalini, LMartini, EDei, SManetti, DScapecchi, STeodori, ESartiani, LMugelli, ACerbai, ERomanelli, MN Design, synthesis, and preliminary biological evaluation of new isoform-selective f-current blockers. J Med Chem 53:6773-7 (2010)  
Target
Name:
Potassium/sodium hyperpolarization-activated cyclic nucleotide-gated channel 2
Synonyms:
BCNG-2 Brain cyclic nucleotide-gated channel 2 HCN2_MOUSE Hcn2 | Hyperpolarization-activated cation channel 1
Type:
PROTEIN
Mol. Mass.:
94741.48
Organism:
Mus musculus
Description:
ChEMBL_663438
Residue:
863
  
Inhibitor
Name:
BDBM50326987
Synonyms:
3-((Z)-4-(((S)-2-(3,4-dimethoxyphenyl)propyl)(methyl)amino)but-2-enyl)-7,8-dimethoxy-1H-benzo[d]azepin-2(3H)-one | CHEMBL1254180
Type:
Small organic molecule
Emp. Form.:
C28H36N2O5
Mol. Mass.:
480.5958
SMILES:
COc1ccc(cc1OC)[C@H](C)CN(C)C\C=C/CN1C=Cc2cc(OC)c(OC)cc2CC1=O
: