Target
Potassium/sodium hyperpolarization-activated cyclic nucleotide-gated channel 1
Ligand
BDBM50326989
Substrate
Meas. Tech.
ChEMBL_663436 (CHEMBL1250984)
EC50
9410±n/a nM
Citation
 Melchiorre, MDel Lungo, MGuandalini, LMartini, EDei, SManetti, DScapecchi, STeodori, ESartiani, LMugelli, ACerbai, ERomanelli, MN Design, synthesis, and preliminary biological evaluation of new isoform-selective f-current blockers. J Med Chem 53:6773-7 (2010)  
Target
Name:
Potassium/sodium hyperpolarization-activated cyclic nucleotide-gated channel 1
Synonyms:
BCNG-1 Brain cyclic nucleotide-gated channel 1 HCN1_MOUSE Hcn1 | Hyperpolarization-activated cation channel 2
Type:
PROTEIN
Mol. Mass.:
102447.84
Organism:
Mus musculus
Description:
ChEMBL_663436
Residue:
910
  
Inhibitor
Name:
BDBM50326989
Synonyms:
3-((Z)-4-(((R)-2-(3,4-dimethoxyphenyl)propyl)(methyl)amino)but-2-enyl)-7,8-dimethoxy-1H-benzo[d]azepin-2(3H)-one | CHEMBL1253992
Type:
Small organic molecule
Emp. Form.:
C28H36N2O5
Mol. Mass.:
480.5958
SMILES:
COc1ccc(cc1OC)[C@@H](C)CN(C)C\C=C/CN1C=Cc2cc(OC)c(OC)cc2CC1=O
: