Target
Mitogen-activated protein kinase 14
Ligand
BDBM50327181
Substrate
Meas. Tech.
ChEMBL_664215 (CHEMBL1261656)
Ki
176±n/a nM
Citation
 Swann, SLMerta, PJKifle, LGroebe, DSarris, KHajduk, PJSun, C Biochemical and biophysical characterization of unique switch pocket inhibitors of p38a. Bioorg Med Chem Lett 20:5787-92 (2010)  
Target
Name:
Mitogen-activated protein kinase 14
Synonyms:
CSAID-binding protein CSBP1 CSPB1 MAP kinase 14 MAP kinase p38 alpha MAPK14 MK14_HUMAN Mitogen-activated protein kinase p38 alpha Stress-activated protein kinase 2a | p38 MAP kinase alpha/beta
Type:
Serine/threonine-protein kinase
Mol. Mass.:
41286.76
Organism:
Homo sapiens (Human)
Description:
Q16539
Residue:
360
  
Inhibitor
Name:
BDBM50327181
Synonyms:
5-(3-tert-butyl-5-(3-naphthalen-1-ylureido)-1H-pyrazol-1-yl)-2-methyl-N-(pyridin-4-ylmethyl)benzamide | CHEMBL1257813
Type:
Small organic molecule
Emp. Form.:
C32H32N6O2
Mol. Mass.:
532.6355
SMILES:
Cc1ccc(cc1C(=O)NCc1ccncc1)-n1nc(cc1NC(=O)Nc1cccc2ccccc12)C(C)(C)C
: