Target
Mitogen-activated protein kinase 14
Ligand
BDBM50327182
Substrate
Meas. Tech.
ChEMBL_664215 (CHEMBL1261656)
Ki
157±n/a nM
Citation
 Swann, SLMerta, PJKifle, LGroebe, DSarris, KHajduk, PJSun, C Biochemical and biophysical characterization of unique switch pocket inhibitors of p38a. Bioorg Med Chem Lett 20:5787-92 (2010)  
Target
Name:
Mitogen-activated protein kinase 14
Synonyms:
CSAID-binding protein CSBP1 CSPB1 MAP kinase 14 MAP kinase p38 alpha MAPK14 MK14_HUMAN Mitogen-activated protein kinase p38 alpha Stress-activated protein kinase 2a | p38 MAP kinase alpha/beta
Type:
Serine/threonine-protein kinase
Mol. Mass.:
41286.76
Organism:
Homo sapiens (Human)
Description:
Q16539
Residue:
360
  
Inhibitor
Name:
BDBM50327182
Synonyms:
CHEMBL1257691 | N-(2-aminoethyl)-5-(3-tert-butyl-5-(3-naphthalen-1-ylureido)-1H-pyrazol-1-yl)-N-ethyl-2-methylbenzamide
Type:
Small organic molecule
Emp. Form.:
C30H36N6O2
Mol. Mass.:
512.6458
SMILES:
CCN(CCN)C(=O)c1cc(ccc1C)-n1nc(cc1NC(=O)Nc1cccc2ccccc12)C(C)(C)C
: