Target
Adenosine receptor A1
Ligand
BDBM50327335
Substrate
Meas. Tech.
ChEMBL_664373 (CHEMBL1259522)
IC50
5.1±n/a nM
Citation
 Griebenow, NBärfacker, LMeier, HSchneider, DTeusch, NLustig, KKast, RKolkhof, P Identification and optimization of substituted 5-aminopyrazoles as potent and selective adenosine A1 receptor antagonists. Bioorg Med Chem Lett 20:5891-4 (2010)  
Target
Name:
Adenosine receptor A1
Synonyms:
A1 adenosine receptor (hA1) AA1R_HUMAN ADORA1 Adenosine A1-receptor Adenosine receptor A1 (hA1) | Adenosine transporter (AdT)
Type:
G Protein-Coupled Receptor (GPCR)
Mol. Mass.:
36520.92
Organism:
Homo sapiens (Human)
Description:
P30542
Residue:
326
  
Inhibitor
Name:
BDBM50327335
Synonyms:
5-methyl-2-(3-methyl-4-(quinoxalin-6-yl)-1-o-tolyl-1H-pyrazol-5-ylamino)benzoic acid | CHEMBL1258284
Type:
Small organic molecule
Emp. Form.:
C27H23N5O2
Mol. Mass.:
449.5038
SMILES:
Cc1nn(c(Nc2ccc(C)cc2C(O)=O)c1-c1ccc2nccnc2c1)-c1ccccc1C
: