Target
LIM domain kinase 2
Ligand
BDBM50327391
Substrate
Meas. Tech.
ChEMBL_664472 (CHEMBL1259854)
IC50
3.05±n/a nM
Citation
 Lin, SWrobleski, STHynes, JPitt, SZhang, RFan, YDoweyko, AMKish, KFSack, JSMalley, MFKiefer, SENewitt, JAMcKinnon, MTrzaskos, JBarrish, JCDodd, JHSchieven, GLLeftheris, K Utilization of a nitrogen-sulfur nonbonding interaction in the design of new 2-aminothiazol-5-yl-pyrimidines as p38a MAP kinase inhibitors. Bioorg Med Chem Lett 20:5864-8 (2010)  
Target
Name:
LIM domain kinase 2
Synonyms:
LIMK2 | LIMK2_HUMAN
Type:
PROTEIN
Mol. Mass.:
72238.81
Organism:
Homo sapiens (Human)
Description:
ChEMBL_1514398
Residue:
638
  
Inhibitor
Name:
BDBM50327391
Synonyms:
CHEMBL1258976 | N1-(4-(2-chlorophenyl)-6-(2-(isopropylamino)thiazol-5-yl)pyrimidin-2-yl)-N2,N2-dimethylethane-1,2-diamine
Type:
Small organic molecule
Emp. Form.:
C20H25ClN6S
Mol. Mass.:
416.971
SMILES:
CC(C)Nc1ncc(s1)-c1cc(nc(NCCN(C)C)n1)-c1ccccc1Cl
: