Target
Bifunctional epoxide hydrolase 2
Ligand
BDBM50327850
Substrate
Meas. Tech.
ChEMBL_664906 (CHEMBL1259738)
IC50
0.4±n/a nM
Citation
 Rose, TEMorisseau, CLiu, JYInceoglu, BJones, PDSanborn, JRHammock, BD 1-Aryl-3-(1-acylpiperidin-4-yl)urea inhibitors of human and murine soluble epoxide hydrolase: structure-activity relationships, pharmacokinetics, and reduction of inflammatory pain. J Med Chem 53:7067-75 (2010)  
Target
Name:
Bifunctional epoxide hydrolase 2
Synonyms:
Eph2 Epoxide hydratase Soluble epoxide hydrolase (sEH)
Type:
Enzyme
Mol. Mass.:
62512.06
Organism:
Mus musculus (Mouse)
Description:
P34914
Residue:
554
  
Inhibitor
Name:
BDBM50327850
Synonyms:
1-(1-Tosylpiperidin-4-yl)-3-(4-(trifluoromethoxy)phenyl)urea US8501783, 1711 | US9296693, 58
Type:
Small organic molecule
Emp. Form.:
C20H22F3N3O4S
Mol. Mass.:
457.467
SMILES:
Cc1ccc(cc1)S(=O)(=O)N1CCC(CC1)NC(=O)Nc1ccc(OC(F)(F)F)cc1
: