Target
Bifunctional epoxide hydrolase 2
Ligand
BDBM50327851
Substrate
Meas. Tech.
ChEMBL_664906 (CHEMBL1259738)
IC50
1.2±n/a nM
Citation
 Rose, TEMorisseau, CLiu, JYInceoglu, BJones, PDSanborn, JRHammock, BD 1-Aryl-3-(1-acylpiperidin-4-yl)urea inhibitors of human and murine soluble epoxide hydrolase: structure-activity relationships, pharmacokinetics, and reduction of inflammatory pain. J Med Chem 53:7067-75 (2010)  
Target
Name:
Bifunctional epoxide hydrolase 2
Synonyms:
Eph2 Epoxide hydratase Soluble epoxide hydrolase (sEH)
Type:
Enzyme
Mol. Mass.:
62512.06
Organism:
Mus musculus (Mouse)
Description:
P34914
Residue:
554
  
Inhibitor
Name:
BDBM50327851
Synonyms:
1-(1-((4-Acetylpiperazin-1-yl)acetyl)piperidin-4-yl)-3-(4-(trifluoromethoxy)phenyl)urea US9296693, 51
Type:
Small organic molecule
Emp. Form.:
C21H28F3N5O4
Mol. Mass.:
471.4733
SMILES:
CC(=O)N1CCN(CC(=O)N2CCC(CC2)NC(=O)Nc2ccc(OC(F)(F)F)cc2)CC1
: