Target
5-hydroxytryptamine receptor 4
Ligand
BDBM50327863
Substrate
Meas. Tech.
ChEMBL_664907 (CHEMBL1259739)
Ki
0.334000±n/a nM
Citation
 Xu, RHong, JMorse, CLPike, VW Synthesis, structure-affinity relationships, and radiolabeling of selective high-affinity 5-HT4 receptor ligands as prospective imaging probes for positron emission tomography. J Med Chem 53:7035-47 (2010)  
Target
Name:
5-hydroxytryptamine receptor 4
Synonyms:
5-HT4 5HT4R_CAVPO Serotonin 4 (5-HT4) receptor
Type:
Enzyme Catalytic Domain
Mol. Mass.:
43735.29
Organism:
GUINEA PIG
Description:
5-HT4 HTR4 GUINEA PIG::O70528
Residue:
388
  
Inhibitor
Name:
BDBM50327863
Synonyms:
(1-Butylpiperidin-4-yl)methyl 8-Amino-7-fluoro-2,3-dihydrobenzo[b][1,4]dioxine-5-carboxylate | CHEMBL1258671
Type:
Small organic molecule
Emp. Form.:
C19H27FN2O4
Mol. Mass.:
366.4271
SMILES:
CCCCN1CCC(COC(=O)c2cc(F)c(N)c3OCCOc23)CC1
: