Target
5-hydroxytryptamine receptor 4
Ligand
BDBM50327863
Substrate
Meas. Tech.
ChEMBL_664908 (CHEMBL1259740)
Ki
2.1±n/a nM
Citation
 Xu, RHong, JMorse, CLPike, VW Synthesis, structure-affinity relationships, and radiolabeling of selective high-affinity 5-HT4 receptor ligands as prospective imaging probes for positron emission tomography. J Med Chem 53:7035-47 (2010)  
Target
Name:
5-hydroxytryptamine receptor 4
Synonyms:
5-HT-4 5-HT4S 5-HT4b 5-HT4d 5-hydroxytryptamine receptor 4 5HT4R_HUMAN Serotonin (5-HT) receptor Serotonin 4 (5-HT4) receptor | Serotonin Receptor 4
Type:
Enzyme
Mol. Mass.:
43767.54
Organism:
Homo sapiens (Human)
Description:
Q13639
Residue:
388
  
Inhibitor
Name:
BDBM50327863
Synonyms:
(1-Butylpiperidin-4-yl)methyl 8-Amino-7-fluoro-2,3-dihydrobenzo[b][1,4]dioxine-5-carboxylate | CHEMBL1258671
Type:
Small organic molecule
Emp. Form.:
C19H27FN2O4
Mol. Mass.:
366.4271
SMILES:
CCCCN1CCC(COC(=O)c2cc(F)c(N)c3OCCOc23)CC1
: