Target
Mu-type opioid receptor
Ligand
BDBM50327860
Substrate
Meas. Tech.
ChEMBL_664961 (CHEMBL1259918)
Ki
>10000±n/a nM
Citation
 Xu, RHong, JMorse, CLPike, VW Synthesis, structure-affinity relationships, and radiolabeling of selective high-affinity 5-HT4 receptor ligands as prospective imaging probes for positron emission tomography. J Med Chem 53:7035-47 (2010)  
Target
Name:
Mu-type opioid receptor
Synonyms:
M-OR-1 MOR-1 MUOR1 Mu opiate receptor OPRM1 hMOP | mu-type opioid receptor isoform MOR-1
Type:
G Protein-Coupled Receptor (GPCR)
Mol. Mass.:
44789.51
Organism:
Homo sapiens (Human)
Description:
P35372
Residue:
400
  
Inhibitor
Name:
BDBM50327860
Synonyms:
(1-Butylpiperidin-4-yl)methyl 7-chloro-8-(methylamino)-2,3-dihydrobenzo[b][1,4]dioxine-5-carboxylate | CHEMBL1258223
Type:
Small organic molecule
Emp. Form.:
C20H29ClN2O4
Mol. Mass.:
396.908
SMILES:
CCCCN1CCC(COC(=O)c2cc(Cl)c(NC)c3OCCOc23)CC1
: