Target
5-hydroxytryptamine receptor 7
Ligand
BDBM50327861
Substrate
Meas. Tech.
ChEMBL_664934 (CHEMBL1259766)
Ki
>10000±n/a nM
Citation
 Xu, RHong, JMorse, CLPike, VW Synthesis, structure-affinity relationships, and radiolabeling of selective high-affinity 5-HT4 receptor ligands as prospective imaging probes for positron emission tomography. J Med Chem 53:7035-47 (2010)  
Target
Name:
5-hydroxytryptamine receptor 7
Synonyms:
5-HT-7 5-HT7 5-HT7S 5HT7 HTR7 | Serotonin receptor 7
Type:
G Protein-Coupled Receptor (GPCR)
Mol. Mass.:
53573.08
Organism:
Homo sapiens (Human)
Description:
P34969
Residue:
479
  
Inhibitor
Name:
BDBM50327861
Synonyms:
(1-Butylpiperidin-4-yl)methyl 4-Amino-3-methoxybenzoate | CHEMBL1258452
Type:
Small organic molecule
Emp. Form.:
C18H28N2O3
Mol. Mass.:
320.4265
SMILES:
CCCCN1CCC(COC(=O)c2ccc(N)c(OC)c2)CC1
: