Target
Muscarinic acetylcholine receptor M4
Ligand
BDBM50327863
Substrate
Meas. Tech.
ChEMBL_664965 (CHEMBL1259922)
Ki
>10000±n/a nM
Citation
 Xu, RHong, JMorse, CLPike, VW Synthesis, structure-affinity relationships, and radiolabeling of selective high-affinity 5-HT4 receptor ligands as prospective imaging probes for positron emission tomography. J Med Chem 53:7035-47 (2010)  
Target
Name:
Muscarinic acetylcholine receptor M4
Synonyms:
ACM4_HUMAN Cholinergic, muscarinic M4 Muscarinic acetylcholine receptor M2 and M4
Type:
Enzyme Catalytic Domain
Mol. Mass.:
53079.31
Organism:
Homo sapiens (Human)
Description:
Cholinergic, muscarinic M4 CHRM4 HUMAN M3::P08173
Residue:
479
  
Inhibitor
Name:
BDBM50327863
Synonyms:
(1-Butylpiperidin-4-yl)methyl 8-Amino-7-fluoro-2,3-dihydrobenzo[b][1,4]dioxine-5-carboxylate | CHEMBL1258671
Type:
Small organic molecule
Emp. Form.:
C19H27FN2O4
Mol. Mass.:
366.4271
SMILES:
CCCCN1CCC(COC(=O)c2cc(F)c(N)c3OCCOc23)CC1
: