Target
5-hydroxytryptamine receptor 7
Ligand
BDBM50327860
Substrate
Meas. Tech.
ChEMBL_664934 (CHEMBL1259766)
Ki
5702±n/a nM
Citation
 Xu, RHong, JMorse, CLPike, VW Synthesis, structure-affinity relationships, and radiolabeling of selective high-affinity 5-HT4 receptor ligands as prospective imaging probes for positron emission tomography. J Med Chem 53:7035-47 (2010)  
Target
Name:
5-hydroxytryptamine receptor 7
Synonyms:
5-HT-7 5-HT7 5-HT7S 5HT7 HTR7 | Serotonin receptor 7
Type:
G Protein-Coupled Receptor (GPCR)
Mol. Mass.:
53573.08
Organism:
Homo sapiens (Human)
Description:
P34969
Residue:
479
  
Inhibitor
Name:
BDBM50327860
Synonyms:
(1-Butylpiperidin-4-yl)methyl 7-chloro-8-(methylamino)-2,3-dihydrobenzo[b][1,4]dioxine-5-carboxylate | CHEMBL1258223
Type:
Small organic molecule
Emp. Form.:
C20H29ClN2O4
Mol. Mass.:
396.908
SMILES:
CCCCN1CCC(COC(=O)c2cc(Cl)c(NC)c3OCCOc23)CC1
: