Target
Alpha-1A adrenergic receptor
Ligand
BDBM50327863
Substrate
Meas. Tech.
ChEMBL_664936 (CHEMBL1259768)
Ki
88±n/a nM
Citation
 Xu, RHong, JMorse, CLPike, VW Synthesis, structure-affinity relationships, and radiolabeling of selective high-affinity 5-HT4 receptor ligands as prospective imaging probes for positron emission tomography. J Med Chem 53:7035-47 (2010)  
Target
Name:
Alpha-1A adrenergic receptor
Synonyms:
ADA1A_HUMAN ADRA1C Alpha 1A-adrenoceptor Alpha adrenergic receptor 1a Alpha-adrenergic receptor 1c adrenergic Alpha1 | adrenergic Alpha1C
Type:
Cell-surface receptors
Mol. Mass.:
51511.67
Organism:
Homo sapiens (Human)
Description:
P35348
Residue:
466
  
Inhibitor
Name:
BDBM50327863
Synonyms:
(1-Butylpiperidin-4-yl)methyl 8-Amino-7-fluoro-2,3-dihydrobenzo[b][1,4]dioxine-5-carboxylate | CHEMBL1258671
Type:
Small organic molecule
Emp. Form.:
C19H27FN2O4
Mol. Mass.:
366.4271
SMILES:
CCCCN1CCC(COC(=O)c2cc(F)c(N)c3OCCOc23)CC1
: