Target
Malonyl-CoA decarboxylase, mitochondrial
Ligand
BDBM50328242
Substrate
Meas. Tech.
ChEMBL_665405 (CHEMBL1261134)
EC50
1100±n/a nM
Citation
 Tang, HYan, YFeng, Zde Jesus, RKYang, LLevorse, DAOwens, KAAkiyama, TEBergeron, RCastriota, GADoebber, TWEllsworth, KPLassman, MELi, CWu, MSZhang, BBChapman, KTMills, SGBerger, JPPasternak, A Design and synthesis of a new class of malonyl-CoA decarboxylase inhibitors with anti-obesity and anti-diabetic activities. Bioorg Med Chem Lett 20:6088-92 (2010)  
Target
Name:
Malonyl-CoA decarboxylase, mitochondrial
Synonyms:
DCMC_MOUSE Mlycd
Type:
PROTEIN
Mol. Mass.:
54752.52
Organism:
Mus musculus
Description:
ChEMBL_665405
Residue:
492
  
Inhibitor
Name:
BDBM50328242
Synonyms:
1-(5-(1,1,1,3,3,3-hexafluoro-2-hydroxypropan-2-yl)thiazol-2-yl)-4-phenylpiperidine-4-carboxamide | CHEMBL1258019
Type:
Small organic molecule
Emp. Form.:
C18H17F6N3O2S
Mol. Mass.:
453.402
SMILES:
NC(=O)C1(CCN(CC1)c1ncc(s1)C(O)(C(F)(F)F)C(F)(F)F)c1ccccc1
: