Target
Beta-1 adrenergic receptor
Ligand
BDBM50328302
Substrate
Meas. Tech.
ChEMBL_665487 (CHEMBL1261318)
Ki
1480±n/a nM
Citation
 Tasler, SBaumgartner, RAmmendola, ASchachtner, JWieber, TBlisse, MRath, SZaja, MKlahn, PQuotschalla, UNey, P Thienopyrimidines asß3-adrenoceptor agonists: hit-to-lead optimization. Bioorg Med Chem Lett 20:6108-15 (2010)  
Target
Name:
Beta-1 adrenergic receptor
Synonyms:
ADRB1 ADRB1_HUMAN Beta-1 adrenoceptor | adrenergic Beta1
Type:
G Protein-Coupled Receptor (GPCR)
Mol. Mass.:
51338.40
Organism:
Homo sapiens (Human)
Description:
P08588
Residue:
477
  
Inhibitor
Name:
BDBM50328302
Synonyms:
4-(2-hydroxy-3-(1-(5-phenylthieno[2,3-d]pyrimidin-4-yl)piperidin-4-ylamino)propoxy)-3-(hydroxymethyl)phenol | CHEMBL1257554
Type:
Small organic molecule
Emp. Form.:
C27H30N4O4S
Mol. Mass.:
506.617
SMILES:
OCc1cc(O)ccc1OCC(O)CNC1CCN(CC1)c1ncnc2scc(-c3ccccc3)c12
: