Target
Beta-3 adrenergic receptor
Ligand
BDBM50328336
Substrate
Meas. Tech.
ChEMBL_665493 (CHEMBL1261324)
Ki
8.5±n/a nM
Citation
 Tasler, SBaumgartner, RAmmendola, ASchachtner, JWieber, TBlisse, MRath, SZaja, MKlahn, PQuotschalla, UNey, P Thienopyrimidines asß3-adrenoceptor agonists: hit-to-lead optimization. Bioorg Med Chem Lett 20:6108-15 (2010)  
Target
Name:
Beta-3 adrenergic receptor
Synonyms:
ADRB3 ADRB3_HUMAN Beta-2 adrenergic receptor and beta-3 adrenergic receptor Beta-3 adrenoreceptor | adrenergic Beta3
Type:
G Protein-Coupled Receptor (GPCR)
Mol. Mass.:
43534.88
Organism:
Homo sapiens (Human)
Description:
Residue:
408
  
Inhibitor
Name:
BDBM50328336
Synonyms:
3-(2-hydroxy-3-(1-(5-phenylthieno[2,3-d]pyrimidin-4-yl)piperidin-4-ylamino)propoxy)phenol | CHEMBL1257913
Type:
Small organic molecule
Emp. Form.:
C26H28N4O3S
Mol. Mass.:
476.591
SMILES:
OC(CNC1CCN(CC1)c1ncnc2scc(-c3ccccc3)c12)COc1cccc(O)c1
: