Target
Diacylglycerol O-acyltransferase 1
Ligand
BDBM50328378
Substrate
Meas. Tech.
ChEMBL_665509 (CHEMBL1261340)
IC50
<30±n/a nM
Citation
 Fox, BMIio, KLi, KChoi, RInaba, TJackson, SSagawa, SShan, BTanaka, MYoshida, AKayser, F Discovery of pyrrolopyridazines as novel DGAT1 inhibitors. Bioorg Med Chem Lett 20:6030-3 (2010)  
Target
Name:
Diacylglycerol O-acyltransferase 1
Synonyms:
ACAT-related gene product 1 Acyl coA-diacylglycerol acyl transferase 1 (DGAT1) DGAT1 Diacylglycerol Acyltransferase (DGAT1) Diacylglycerol O-acyltransferase 1 (DGAT1) | Diglyceride acyltransferase
Type:
Protein
Mol. Mass.:
55297.82
Organism:
Homo sapiens (Human)
Description:
O75907
Residue:
488
  
Inhibitor
Name:
BDBM50328378
Synonyms:
CHEMBL1258829 | ethyl 6-(3-cyclopentyl-1,2,4-oxadiazol-5-yl)-2-morpholino-4-phenyl-7-propylpyrrolo[1,2-b]pyridazine-5-carboxylate
Type:
Small organic molecule
Emp. Form.:
C30H35N5O4
Mol. Mass.:
529.63
SMILES:
CCCc1c(-c2nc(no2)C2CCCC2)c(C(=O)OCC)c2c(cc(nn12)N1CCOCC1)-c1ccccc1
: