Target
Diacylglycerol O-acyltransferase 1
Ligand
BDBM50328355
Substrate
Meas. Tech.
ChEMBL_665507 (CHEMBL1261338)
IC50
470±n/a nM
Citation
 Fox, BMIio, KLi, KChoi, RInaba, TJackson, SSagawa, SShan, BTanaka, MYoshida, AKayser, F Discovery of pyrrolopyridazines as novel DGAT1 inhibitors. Bioorg Med Chem Lett 20:6030-3 (2010)  
Target
Name:
Diacylglycerol O-acyltransferase 1
Synonyms:
ACAT-related gene product 1 Acyl coA-diacylglycerol acyl transferase 1 (DGAT1) DGAT1 Diacylglycerol Acyltransferase (DGAT1) Diacylglycerol O-acyltransferase 1 (DGAT1) | Diglyceride acyltransferase
Type:
Protein
Mol. Mass.:
55297.82
Organism:
Homo sapiens (Human)
Description:
O75907
Residue:
488
  
Inhibitor
Name:
BDBM50328355
Synonyms:
CHEMBL1258487 | diethyl 7-(3-methoxyphenyl)-2-morpholino-4-phenylpyrrolo[1,2-b]pyridazine-5,6-dicarboxylate
Type:
Small organic molecule
Emp. Form.:
C30H31N3O6
Mol. Mass.:
529.5836
SMILES:
CCOC(=O)c1c(C(=O)OCC)c2c(cc(nn2c1-c1cccc(OC)c1)N1CCOCC1)-c1ccccc1
: