Target
Diacylglycerol O-acyltransferase 1
Ligand
BDBM50328356
Substrate
Meas. Tech.
ChEMBL_665507 (CHEMBL1261338)
IC50
520±n/a nM
Citation
 Fox, BMIio, KLi, KChoi, RInaba, TJackson, SSagawa, SShan, BTanaka, MYoshida, AKayser, F Discovery of pyrrolopyridazines as novel DGAT1 inhibitors. Bioorg Med Chem Lett 20:6030-3 (2010)  
Target
Name:
Diacylglycerol O-acyltransferase 1
Synonyms:
ACAT-related gene product 1 Acyl coA-diacylglycerol acyl transferase 1 (DGAT1) DGAT1 Diacylglycerol Acyltransferase (DGAT1) Diacylglycerol O-acyltransferase 1 (DGAT1) | Diglyceride acyltransferase
Type:
Protein
Mol. Mass.:
55297.82
Organism:
Homo sapiens (Human)
Description:
O75907
Residue:
488
  
Inhibitor
Name:
BDBM50328356
Synonyms:
CHEMBL1257677 | diethyl 7-methyl-2-morpholino-4-phenylpyrrolo[1,2-b]pyridazine-5,6-dicarboxylate
Type:
Small organic molecule
Emp. Form.:
C24H27N3O5
Mol. Mass.:
437.4883
SMILES:
CCOC(=O)c1c(C)n2nc(cc(-c3ccccc3)c2c1C(=O)OCC)N1CCOCC1
: