Target
Diacylglycerol O-acyltransferase 1
Ligand
BDBM50328382
Substrate
Meas. Tech.
ChEMBL_665507 (CHEMBL1261338)
IC50
73±n/a nM
Citation
 Fox, BMIio, KLi, KChoi, RInaba, TJackson, SSagawa, SShan, BTanaka, MYoshida, AKayser, F Discovery of pyrrolopyridazines as novel DGAT1 inhibitors. Bioorg Med Chem Lett 20:6030-3 (2010)  
Target
Name:
Diacylglycerol O-acyltransferase 1
Synonyms:
ACAT-related gene product 1 Acyl coA-diacylglycerol acyl transferase 1 (DGAT1) DGAT1 Diacylglycerol Acyltransferase (DGAT1) Diacylglycerol O-acyltransferase 1 (DGAT1) | Diglyceride acyltransferase
Type:
Protein
Mol. Mass.:
55297.82
Organism:
Homo sapiens (Human)
Description:
O75907
Residue:
488
  
Inhibitor
Name:
BDBM50328382
Synonyms:
CHEMBL1258263 | ethyl 6-(3-butyl-1,2,4-oxadiazol-5-yl)-2-morpholino-4-phenyl-7-propylpyrrolo[1,2-b]pyridazine-5-carboxylate
Type:
Small organic molecule
Emp. Form.:
C29H35N5O4
Mol. Mass.:
517.6193
SMILES:
CCCCc1noc(n1)-c1c(CCC)n2nc(cc(-c3ccccc3)c2c1C(=O)OCC)N1CCOCC1
: