Target
Aurora kinase C
Ligand
BDBM50328436
Substrate
Meas. Tech.
ChEMBL_665542 (CHEMBL1261373)
IC50
1950±n/a nM
Citation
 Bouloc, NLarge, JMKosmopoulou, MSun, CFaisal, AMatteucci, MReynisson, JBrown, NAtrash, BBlagg, JMcDonald, ELinardopoulos, SBayliss, RBavetsias, V Structure-based design of imidazo[1,2-a]pyrazine derivatives as selective inhibitors of Aurora-A kinase in cells. Bioorg Med Chem Lett 20:5988-93 (2010)  
Target
Name:
Aurora kinase C
Synonyms:
AIE2 AIRK3 AURKC Aurora Kinase C (Aurora-C) Aurora kinase C (AURKC) Aurora-C/INCENP Aurora/Ipl1/Eg2 protein 2 Serine/threonine-protein kinase 13 | Serine/threonine-protein kinase Aurora-C
Type:
Enzyme
Mol. Mass.:
35602.43
Organism:
Homo sapiens (Human)
Description:
Amino acid residues 1-309 were expressed as His-tagged fusion protein using baculovirus expression system.
Residue:
309
  
Inhibitor
Name:
BDBM50328436
Synonyms:
3-chloro-N-(4-morpholin-4-ylphenyl)-6-pyridin-3-ylimidazo[1,2-a]pyrazin-8-amine CHEMBL1231066
Type:
Small organic molecule
Emp. Form.:
C21H19ClN6O
Mol. Mass.:
406.868
SMILES:
Clc1cnc2c(Nc3ccc(cc3)N3CCOCC3)nc(cn12)-c1cccnc1
: