Target
5-hydroxytryptamine receptor 2A
Ligand
BDBM50155520
Substrate
Meas. Tech.
ChEMBL_665580 (CHEMBL1261464)
Ki
440±n/a nM
Citation
 Skultety, MHübner, HLöber, SGmeiner, P Bioisosteric replacement leading to biologically active [2.2]paracyclophanes with altered binding profiles for aminergic G-protein-coupled receptors. J Med Chem 53:7219-28 (2010)  
Target
Name:
5-hydroxytryptamine receptor 2A
Synonyms:
5-HT-2 5-HT2 5HT2A_PIG Serotonin 2a (5-HT2a) receptor
Type:
Enzyme Catalytic Domain
Mol. Mass.:
52679.13
Organism:
PIG
Description:
5-HT2 0 0::P50129
Residue:
470
  
Inhibitor
Name:
BDBM50155520
Synonyms:
4-[4-(4-Chloro-phenyl)-piperazin-1-yl]-1-(4-fluoro-phenyl)-butan-1-one; hydrochloride CHEMBL558392
Type:
Small organic molecule
Emp. Form.:
C20H22ClFN2O
Mol. Mass.:
360.853
SMILES:
Fc1ccc(cc1)C(=O)CCCN1CCN(CC1)c1ccc(Cl)cc1
: